首页 新闻 搜索 专区 学院

maven debug项目的时候报错,求解,谢谢!!!

0
[已关闭问题] 关闭于 2016-06-15 18:14

[INFO] Scanning for projects...
[INFO]                                                                         
[INFO] ------------------------------------------------------------------------
[INFO] Building wap 1.0.0
[INFO] ------------------------------------------------------------------------
[INFO]
[INFO] >>> maven-jetty-plugin:6.1.26:run (default-cli) @ wap >>>
Downloading: http://172.16.1.103:8081/nexus/content/groups/public/com/dzqd/ecop/ecop-search-api/1.0.0-SNAPSHOT/maven-metadata.xml
Downloaded: http://172.16.1.103:8081/nexus/content/groups/public/com/dzqd/ecop/ecop-search-api/1.0.0-SNAPSHOT/maven-metadata.xml (365 B at 1.6 KB/sec)
Downloading: http://172.16.1.103:8081/nexus/content/groups/public/com/dzqd/ecop/ecop-search/1.0.0-SNAPSHOT/maven-metadata.xml
Downloaded: http://172.16.1.103:8081/nexus/content/groups/public/com/dzqd/ecop/ecop-search/1.0.0-SNAPSHOT/maven-metadata.xml (361 B at 10.4 KB/sec)
Downloading: http://172.16.1.103:8081/nexus/content/groups/public/com/dzqd/ucs/ucs-commons-api/1.0-SNAPSHOT/maven-metadata.xml
Downloaded: http://172.16.1.103:8081/nexus/content/groups/public/com/dzqd/ucs/ucs-commons-api/1.0-SNAPSHOT/maven-metadata.xml (362 B at 10.7 KB/sec)
Downloading: http://172.16.1.103:8081/nexus/content/groups/public/com/dzqd/ucs/ucs-commons/1.0-SNAPSHOT/maven-metadata.xml
Downloaded: http://172.16.1.103:8081/nexus/content/groups/public/com/dzqd/ucs/ucs-commons/1.0-SNAPSHOT/maven-metadata.xml (358 B at 7.9 KB/sec)
Downloading: http://172.16.1.103:8081/nexus/content/groups/public/com/dzqd/ucs/ucs/2.0.1-SNAPSHOT/maven-metadata.xml
Downloaded: http://172.16.1.103:8081/nexus/content/groups/public/com/dzqd/ucs/ucs/2.0.1-SNAPSHOT/maven-metadata.xml (352 B at 10.1 KB/sec)
Downloading: http://172.16.1.103:8081/nexus/content/groups/public/com/dzqd/ucs/ucs-core/2.0.1-SNAPSHOT/maven-metadata.xml
Downloaded: http://172.16.1.103:8081/nexus/content/groups/public/com/dzqd/ucs/ucs-core/2.0.1-SNAPSHOT/maven-metadata.xml (357 B at 10.6 KB/sec)
Downloading: http://172.16.1.103:8081/nexus/content/groups/public/com/dzqd/ecop/ecop-recharge-api/1.5.1-SNAPSHOT/maven-metadata.xml
Downloaded: http://172.16.1.103:8081/nexus/content/groups/public/com/dzqd/ecop/ecop-recharge-api/1.5.1-SNAPSHOT/maven-metadata.xml (367 B at 10.2 KB/sec)
Downloading: http://172.16.1.103:8081/nexus/content/groups/public/com/dzqd/ecop/ecop-recharge/1.5.1-SNAPSHOT/maven-metadata.xml
Downloaded: http://172.16.1.103:8081/nexus/content/groups/public/com/dzqd/ecop/ecop-recharge/1.5.1-SNAPSHOT/maven-metadata.xml (363 B at 8.1 KB/sec)
Downloading: http://172.16.1.103:8081/nexus/content/groups/public/com/dzqd/gaf/gaf-parent/1.2.11-SNAPSHOT/maven-metadata.xml
Downloaded: http://172.16.1.103:8081/nexus/content/groups/public/com/dzqd/gaf/gaf-parent/1.2.11-SNAPSHOT/maven-metadata.xml (359 B at 0.9 KB/sec)
Downloading: http://172.16.1.103:8081/nexus/content/groups/public/com/dzqd/ecop/ecop-async-support-api/0.0.1-SNAPSHOT/maven-metadata.xml
Downloaded: http://172.16.1.103:8081/nexus/content/groups/public/com/dzqd/ecop/ecop-async-support-api/0.0.1-SNAPSHOT/maven-metadata.xml (372 B at 9.6 KB/sec)
Downloading: http://172.16.1.103:8081/nexus/content/groups/public/com/dzqd/ecop/ecop-async-support/0.0.1-SNAPSHOT/maven-metadata.xml
Downloaded: http://172.16.1.103:8081/nexus/content/groups/public/com/dzqd/ecop/ecop-async-support/0.0.1-SNAPSHOT/maven-metadata.xml (367 B at 10.5 KB/sec)
Downloading: http://172.16.1.103:8081/nexus/content/groups/public/com/dzqd/gaf/gaf-parent/1.2.7-SNAPSHOT/maven-metadata.xml
Downloaded: http://172.16.1.103:8081/nexus/content/groups/public/com/dzqd/gaf/gaf-parent/1.2.7-SNAPSHOT/maven-metadata.xml (358 B at 9.7 KB/sec)
Downloading: http://172.16.1.103:8081/nexus/content/groups/public/com/dzqd/ecop/ecop-weixing-api/0.0.1-SNAPSHOT/maven-metadata.xml
Downloaded: http://172.16.1.103:8081/nexus/content/groups/public/com/dzqd/ecop/ecop-weixing-api/0.0.1-SNAPSHOT/maven-metadata.xml (365 B at 7.6 KB/sec)
Downloading: http://172.16.1.103:8081/nexus/content/groups/public/com/dzqd/ecop/ecop-weixing/0.0.1-SNAPSHOT/maven-metadata.xml
Downloaded: http://172.16.1.103:8081/nexus/content/groups/public/com/dzqd/ecop/ecop-weixing/0.0.1-SNAPSHOT/maven-metadata.xml (361 B at 10.4 KB/sec)
[INFO]
[INFO] --- maven-enforcer-plugin:1.0:enforce (enforce-versions) @ wap ---
[INFO]
[INFO] --- maven-resources-plugin:2.4.2:resources (default-resources) @ wap ---
[INFO] Using 'UTF-8' encoding to copy filtered resources.
[INFO] Copying 34 resources
[INFO]
[INFO] --- maven-compiler-plugin:2.3.2:compile (default-compile) @ wap ---
[INFO] Nothing to compile - all classes are up to date
[INFO]
[INFO] --- aspectj-maven-plugin:1.3.1:compile (default) @ wap ---
[INFO] ------------------------------------------------------------------------
[INFO] BUILD FAILURE
[INFO] ------------------------------------------------------------------------
[INFO] Total time: 4.609s
[INFO] Finished at: Wed Jun 15 16:26:01 CST 2016
[INFO] Final Memory: 11M/154M
[INFO] ------------------------------------------------------------------------
[ERROR] Failed to execute goal org.codehaus.mojo:aspectj-maven-plugin:1.3.1:compile (default) on project wap: Execution default of goal org.codehaus.mojo:aspectj-maven-plugin:1.3.1:compile failed: Plugin org.codehaus.mojo:aspectj-maven-plugin:1.3.1 or one of its dependencies could not be resolved: Could not find artifact com.sun:tools:jar:1.4.2 at specified path C:\Program Files\Java\jre6/../lib/tools.jar -> [Help 1]
[ERROR]
[ERROR] To see the full stack trace of the errors, re-run Maven with the -e switch.
[ERROR] Re-run Maven using the -X switch to enable full debug logging.
[ERROR]
[ERROR] For more information about the errors and possible solutions, please read the following articles:
[ERROR] [Help 1] http://cwiki.apache.org/confluence/display/MAVEN/PluginResolutionException

彼岸叶的主页 彼岸叶 | 菜鸟二级 | 园豆:206
提问于:2016-06-15 16:38
< >
分享
清除回答草稿
   您需要登录以后才能回答,未注册用户请先注册