首页 新闻 搜索 专区 学院
当前位置: 博问标签 /jmter/未解决/ 已解决
0
回答数

BUILD FAILED Target "buildfile:xxxx.jmx" does not exist in the project "ant-jmeter-test"

使用ant执行jmeter脚本,报告生成了,但是返回BUILD FAILED。 BUILD FAILED。 Target "buildfile:xxxx.jmx" does not exist in